{"text_format":"1","workbook":"xlsx","n_sheets":12,"sheets":["Лист1","Лист2","Лист3","Лист4","Лист5","Лист6","Лист7","Лист8","Лист9","Лист10","Лист11","Спецификация"],"not_rendered":{"charts":0,"images":0,"macros":1,"external_links":0,"defined_names":26,"comments":0,"pivot_tables":0},"unopened":[],"bounds":{"document_bytes":16777216,"sheet_cells":100000,"rows_first":2000,"rows_last":500,"rows_between":2000,"halvings":0,"cell_chars":16384,"cell_head_chars":4096},"cells_cut":0,"cells_raw":0,"read":"whole","date_system":"1900"}

{"sheet":"Лист1","index":0,"n_rows":14,"n_cols":7,"rows_kept":14,"cut":false,"hidden":false,"merged":[]}
["№","Вид обработки","Материал обработки","Размеры хвостовика","Доп. информация","Инструмент","Пластина"]
[1,"Точение наружное",null,null,null,{"$f":"IF(E2=\"Прямое точение\",IF($C$2=\"Сталь\",LOOKUP(Лист1!D2,Лист2!B2:B5,Лист2!C2:C5),IF($C$2=\"Нержавеющая сталь\",LOOKUP(Лист1!D2,Лист2!B6:B9,Лист2!C6:C9),LOOKUP(Лист1!D2,Лист2!B10:B13,Лист2!C10:C12))),IF(E2=\"Контурное точение\", IF($C$2=\"Сталь\",LOOKUP(Лист1!D2,Лист2!G2:G5,Лист2!H2:H5),IF($C$2=\"Нержавеющая сталь\",LOOKUP(Лист1!D2,Лист2!G6:G9,Лист2!H6:H9),LOOKUP(Лист1!D2,Лист2!G10:G13,Лист2!H10:H12))),\"#Н/Д\"))","v":"#Н/Д"},{"$f":"IF(E2=\"Прямое точение\",IF($C$2=\"Сталь\",LOOKUP(Лист1!F2,Лист2!C2:C5,Лист2!D2:D5),IF($C$2=\"Нержавеющая сталь\",LOOKUP(Лист1!F2,Лист2!C6:C9,Лист2!D6:D9),LOOKUP(Лист1!F2,Лист2!C10:C13,Лист2!D10:D13))),IF($C$2=\"Сталь\",LOOKUP(Лист1!F2,Лист2!H2:H5,Лист2!I2:I5),IF($C$2=\"Нержавеющая сталь\",LOOKUP(Лист1!F2,Лист2!H6:H9,Лист2!I6:I9),LOOKUP(Лист1!F2,Лист2!H10:H13,Лист2!I10:I13))))","v":{"$error":"#N/A"}}]
[2,"Точение внутреннее",null,null,null,{"$f":"IF(E3=\"Прямое точение\",IF($C$3=\"Сталь\",LOOKUP(Лист1!D3,Лист3!B2:B6,Лист3!D2:D6),IF($C$3=\"Нержавеющая сталь\",LOOKUP(Лист1!D3,Лист3!B7:B11,Лист3!D7:D11),LOOKUP(Лист1!D3,Лист3!B12:B16,Лист3!D12:D16))),IF(E3=\"Контурное точение\",IF($C$3=\"Сталь\",LOOKUP(Лист1!D3,Лист3!H2:H6,Лист3!J2:J6),IF($C$3=\"Нержавеющая сталь\",LOOKUP(Лист1!D3,Лист3!H7:H11,Лист3!J7:J11),LOOKUP(Лист1!D3,Лист3!H12:H16,Лист3!J12:J16))),\"#Н/Д\"))","v":"#Н/Д"},{"$f":"IF(E3=\"Прямое точение\",IF($C$3=\"Сталь\",LOOKUP(Лист1!F3,Лист3!D2:D6,Лист3!E2:E6),IF($C$3=\"Нержавеющая сталь\",LOOKUP(Лист1!F3,Лист3!D7:D11,Лист3!E7:E11),LOOKUP(Лист1!F3,Лист3!D12:D16,Лист3!E12:E16))),IF(E3=\"Контурное точение\",IF($C$3=\"Сталь\",LOOKUP(Лист1!F3,Лист3!J2:J6,Лист3!K2:K6),IF($C$3=\"Нержавеющая сталь\",LOOKUP(Лист1!F3,Лист3!J7:J11,Лист3!K7:K11),LOOKUP(Лист1!F3,Лист3!J12:J16,Лист3!K12:K16))),\"#Н/Д\"))","v":"#Н/Д"}]
[3,"Точение наружных канавок",null,null,null,{"$f":"IF(Лист1!E4=Лист4!N1,IF($C$4=\"Сталь\",LOOKUP(Лист1!D4,Лист4!B2:B5,Лист4!D2:D5),IF($C$4=\"Нержавеющая сталь\",LOOKUP(Лист1!D4,Лист4!B6:B9,Лист4!D6:D9),LOOKUP(Лист1!D4,Лист4!B10:B13,Лист4!D10:D13))),IF(Лист1!E4=Лист4!N2,IF($C$4=\"Сталь\",LOOKUP(Лист1!D4,Лист4!H2:H5,Лист4!J2:J5),IF($C$4=\"Нержавеющая сталь\",LOOKUP(Лист1!D4,Лист4!H6:H9,Лист4!J6:J9),LOOKUP(Лист1!D4,Лист4!H10:H13,Лист4!J10:J13))),\"#Н/Д\"))","v":"#Н/Д"},{"$f":"IF(Лист1!E4=Лист4!N1,IF($C$4=\"Сталь\",LOOKUP(Лист1!D4,Лист4!B2:B5,Лист4!E2:E5),IF($C$4=\"Нержавеющая сталь\",LOOKUP(Лист1!D4,Лист4!B6:B9,Лист4!E6:E9),LOOKUP(Лист1!D4,Лист4!B10:B13,Лист4!E10:E13))),IF(Лист1!E4=Лист4!N2,IF($C$4=\"Сталь\",LOOKUP(Лист1!D4,Лист4!H2:H5,Лист4!K2:K5),IF($C$4=\"Нержавеющая сталь\",LOOKUP(Лист1!D4,Лист4!H6:H9,Лист4!K6:K9),LOOKUP(Лист1!D4,Лист4!H10:H13,Лист4!K10:K13))),\"#Н/Д\"))","v":"#Н/Д"}]
[4,"Точение внутренних канавок",null,null,null,{"$f":"IF(Лист1!E5=Лист5!N1,IF($C$5=\"Сталь\",LOOKUP(Лист1!D5,Лист5!B2:B5,Лист5!D2:D5),IF($C$5=\"Нержавеющая сталь\",LOOKUP(Лист1!D5,Лист5!B6:B9,Лист5!D6:D9),LOOKUP(Лист1!D5,Лист5!B10:B13,Лист5!D10:D13))),IF(Лист1!E5=Лист5!N2,IF($C$5=\"Сталь\",LOOKUP(Лист1!D5,Лист5!H2:H5,Лист5!J2:J5),IF($C$5=\"Нержавеющая сталь\",LOOKUP(Лист1!D5,Лист5!H6:H9,Лист5!J6:J9),LOOKUP(Лист1!D5,Лист5!H10:H13,Лист5!J10:J13))),\"#Н/Д\"))","v":"#Н/Д"},{"$f":"IF(Лист1!E5=Лист5!N1,IF($C$5=\"Сталь\",LOOKUP(Лист1!D5,Лист5!B2:B5,Лист5!E2:E5),IF($C$5=\"Нержавеющая сталь\",LOOKUP(Лист1!D5,Лист5!B6:B9,Лист5!E6:E9),LOOKUP(Лист1!D5,Лист5!B10:B13,Лист5!E10:E13))),IF(Лист1!E5=Лист5!N2,IF($C$5=\"Сталь\",LOOKUP(Лист1!D5,Лист5!H2:H5,Лист5!K2:K5),IF($C$5=\"Нержавеющая сталь\",LOOKUP(Лист1!D5,Лист5!H6:H9,Лист5!K6:K9),LOOKUP(Лист1!D5,Лист5!H10:H13,Лист5!K10:K13))),\"#Н/Д\"))","v":"#Н/Д"}]
[5,"Сверление",null,{"$f":"LOOKUP(Лист1!E6,Лист6!B2:B32,Лист6!A2:A32)","v":{"$error":"#N/A"}},null,{"$f":"LOOKUP(Лист1!E6,Лист6!B2:B32,Лист6!C2:C32)","v":{"$error":"#N/A"}},"-"]
[6,"Нарезание резьбы метчиками",null,{"$f":"IF($C$7=\"Сталь\",LOOKUP(Лист1!E7,Лист7!B2:B9,Лист7!C2:C9),IF($C$7=\"Нержавеющая сталь\",LOOKUP(Лист1!E7,Лист7!B10:B17,Лист7!C10:C17),LOOKUP(Лист1!E7,Лист7!B18:B24,Лист7!C18:C24)))","v":{"$error":"#N/A"}},null,{"$f":"IF($C$7=\"Сталь\",LOOKUP(Лист1!E7,Лист7!B2:B9,Лист7!D2:D9),IF($C$7=\"Нержавеющая сталь\",LOOKUP(Лист1!E7,Лист7!B10:B17,Лист7!D10:D17),LOOKUP(Лист1!E7,Лист7!B18:B24,Лист7!D18:D24)))","v":{"$error":"#N/A"}},"-"]
[7,"Нарезание наружной резьбы резцами",null,null,null,{"$f":"IF($D$8=\"16х16\",LOOKUP(Лист1!E8,Лист8!B2:B16,Лист8!C2:C16),IF($D$8=\"20х20\",LOOKUP(Лист1!E8,Лист8!B17:B31,Лист8!C17:C31),IF($D$8=\"25х25\",LOOKUP(Лист1!E8,Лист8!B32:B46,Лист8!C32:C46),IF($D$8=\"32х32\",LOOKUP(Лист1!E8,Лист8!B47:B61,Лист8!C47:C61),\"#Н/Д\"))))","v":"#Н/Д"},{"$f":"IF($D$8=\"16х16\",LOOKUP(Лист1!E8,Лист8!B2:B16,Лист8!D2:D16),IF($D$8=\"20х20\",LOOKUP(Лист1!E8,Лист8!B17:B31,Лист8!D17:D31),IF($D$8=\"25х25\",LOOKUP(Лист1!E8,Лист8!B32:B46,Лист8!D32:D46),IF($D$8=\"32х32\",LOOKUP(Лист1!E8,Лист8!B47:B61,Лист8!D47:D61),\"#Н/Д\"))))","v":"#Н/Д"}]
[8,"Нарезание внутренней резьбы резцами",null,null,null,{"$f":"IF($D$9=\"Ø12\",LOOKUP(Лист1!E9,Лист9!B2:B5,Лист9!C2:C5),IF($D$9=\"Ø16\",LOOKUP(Лист1!E9,Лист9!B6:B20,Лист9!C6:C20),IF($D$9=\"Ø20\",LOOKUP(Лист1!E9,Лист9!B21:B35,Лист9!C21:C35),IF($D$9=\"Ø25\",LOOKUP(Лист1!E9,Лист9!B36:B50,Лист9!C36:C50),\"#Н/Д\"))))","v":"#Н/Д"},{"$f":"IF(AND(E9>Лист9!B5, D9=\"Ø12\"),\"Выберите другой шаг резьбы\",IF($D$9=\"Ø12\",LOOKUP(Лист1!E9,Лист9!B2:B5,Лист9!D2:D5),IF($D$9=\"Ø16\",LOOKUP(Лист1!E9,Лист9!B6:B20,Лист9!D6:D20),IF($D$9=\"Ø20\",LOOKUP(Лист1!E9,Лист9!B21:B35,Лист9!D21:D35),IF($D$9=\"Ø25\",LOOKUP(Лист1!E9,Лист9!B36:B50,Лист9!D36:D50),\"#Н/Д\")))))","v":"#Н/Д"}]
[9,"Комбинированный инструмент",null,null,"-",{"$f":"IF($C$10=\"Сталь\",LOOKUP(Лист1!D10,Лист10!B2:B6,Лист10!C2:C6),IF($C$10=\"Нержавеющая сталь\",LOOKUP(Лист1!D10,Лист10!B7:B11,Лист10!C7:C11),LOOKUP(Лист1!D10,Лист10!B12:B16,Лист10!C12:C16)))","v":{"$error":"#N/A"}},{"$f":"IF($C$10=\"Сталь\",LOOKUP(Лист1!D10,Лист10!B2:B6,Лист10!D2:D6),IF($C$10=\"Нержавеющая сталь\",LOOKUP(Лист1!D10,Лист10!B7:B11,Лист10!D7:D11),LOOKUP(Лист1!D10,Лист10!B12:B16,Лист10!D12:D16)))","v":{"$error":"#N/A"}}]
[10,"Отрезка",null,null,"-",{"$f":"IF($C$11=\"Сталь\",LOOKUP(Лист1!D11,Лист11!B2:B4,Лист11!C2:C4),IF($C$11=\"Нержавеющая сталь\",LOOKUP(Лист1!D11,Лист11!B5:B5,Лист11!C5:C7),LOOKUP(Лист1!D11,Лист11!B5:B7,Лист11!C5:C7)))","v":{"$error":"#N/A"}},{"$f":"IF($C$11=\"Сталь\",LOOKUP(Лист1!D11,Лист11!B2:B4,Лист11!D2:D4),IF($C$11=\"Нержавеющая сталь\",LOOKUP(Лист1!D11,Лист11!B5:B5,Лист11!D5:D7),LOOKUP(Лист1!D11,Лист11!B5:B7,Лист11!D5:D7)))","v":{"$error":"#N/A"}}]
[]
[null,null,null,"- выбор из раскрывающегося списка при нажатии"]
[null,null,null,"- справочная информация"]

{"sheet":"Лист2","index":1,"n_rows":18,"n_cols":12,"rows_kept":18,"cut":false,"hidden":true,"merged":[]}
["Материал","Сечение","Державка","Пластина",null,"Материал","Сечение","Державка","Пластина",null,"Сталь","Прямое точение"]
["Сталь","16х16","Державка PCLNR 1616 H12-T","Пластина CNMG 120408EN-M50 CTCP125",null,"Сталь","16х16","Державка DDJNR 1616 H11","Пластина DNMG 110404EN-M50 CTCP125",null,"Нержавеющая сталь","Контурное точение"]
["Сталь","20х20","Державка DCLNR 2020 K12","Пластина CNMG 120408EN-M50 CTCP125",null,"Сталь","20х20","Державка DDJNR 2020 K11","Пластина DNMG 110404EN-M50 CTCP125",null,"Цветные сплавы"]
["Сталь","25х25","Державка DCLNR 2525 M12","Пластина CNMG 120408EN-M50 CTCP125",null,"Сталь","25х25","Державка DDJNR 2525 M11","Пластина DNMG 110404EN-M50 CTCP125"]
["Сталь","32х25","Державка DCLNR 3225 P12","Пластина CNMG 120408EN-M50 CTCP125",null,"Сталь","32х25","Державка DDJNR 3225 P15","Пластина DNMG 150604EN-M50 CTCP125"]
["Нержавеющая сталь","16х16","Державка PCLNR 1616 H12-T","Пластина CNMG 120408EN-M30 CTPM125",null,"Нержавеющая сталь","16х16","Державка DDJNR 1616 H11","Пластина DNMG 110404EN-F30 CTPM125"]
["Нержавеющая сталь","20х20","Державка DCLNR 2020 K12","Пластина CNMG 120408EN-M30 CTPM125",null,"Нержавеющая сталь","20х20","Державка DDJNR 2020 K11","Пластина DNMG 110404EN-F30 CTPM125"]
["Нержавеющая сталь","25х25","Державка DCLNR 2525 M12","Пластина CNMG 120408EN-M30 CTPM125",null,"Нержавеющая сталь","25х25","Державка DDJNR 2525 M11","Пластина DNMG 110404EN-F30 CTPM125"]
["Нержавеющая сталь","32х25","Державка DCLNR 3225 P12","Пластина CNMG 120408EN-M30 CTPM125",null,"Нержавеющая сталь","32х25","Державка DDJNR 3225 P15","Пластина DNMG 150604EN-F30 CTPM125"]
["Цветные сплавы","16х16","Державка SCLCR 1616 H12","Пластина CCGT 120408FN-25P H210T",null,"Цветные сплавы","16х16","Державка SDJCR 1616 H11","Пластина DCGT 11T304FN-25P H210T"]
["Цветные сплавы","20х20","Державка SCLCR 2020 K12","Пластина CCGT 120408FN-25P H210T",null,"Цветные сплавы","20х20","Державка SDJCR 2020 K11","Пластина DCGT 11T304FN-25P H210T"]
["Цветные сплавы","25х25","Державка SCLCR 2525 M12","Пластина CCGT 120408FN-25P H210T",null,"Цветные сплавы","25х25","Державка SDJCR 2525 M11","Пластина DCGT 11T304FN-25P H210T"]
["Цветные сплавы","32х25","Державка SCLCR 3225 P12","Пластина CCGT 120408FN-25P H210T",null,"Цветные сплавы","32х25","Державка SDJCR 3225 P11","Пластина DCGT 11T304FN-25P H210T"]
[]
[]
{"$rows_left_out":4}
{"sheet":"Лист3","index":2,"n_rows":16,"n_cols":14,"rows_kept":16,"cut":false,"hidden":true,"merged":[]}
["Материал","Сечение","Ø min","Державка","Пластина",null,"Материал","Сечение","Ø min","Державка","Пластина",null,"Сталь","Прямое точение"]
["Сталь","Ø12","Ø min=16","Державка A12K SCLCR 06","Пластина CCMT 060204EN-SM CTCP125",null,"Сталь","Ø12","Ø min=16","Державка A12K SDUCR 07","Пластина DCMT 070204EN-SM CTCP125",null,"Нержавеющая сталь","Контурное точение"]
["Сталь","Ø16","Ø min=20","Державка A16M SCLCR 09","Пластина CCMT 09T308EN-SM CTCP125",null,"Сталь","Ø16","Ø min=20","Державка A16M SDUCR 07","Пластина DCMT 070204EN-SM CTCP125",null,"Цветные сплавы"]
["Сталь","Ø20","Ø min=25","Державка A20Q SCLCR 09","Пластина CCMT 09T308EN-SM CTCP125",null,"Сталь","Ø20","Ø min=25","Державка A20Q SDUCR 11","Пластина DCMT 11T304EN-SM CTCP125"]
["Сталь","Ø25","Ø min=32","Державка A25R SCLCR 09","Пластина CCMT 09T308EN-SM CTCP125",null,"Сталь","Ø25","Ø min=32","Державка A25R SDUCR 11","Пластина DCMT 11T304EN-SM CTCP125"]
["Сталь","Ø40","Ø min=50","Державка A40T SCLCR 12","Пластина CCMT 120408EN-SM CTCP125",null,"Сталь","Ø40","Ø min=50","Державка A40T SDUCR 11","Пластина DCMT 11T304EN-SM CTCP125"]
["Нержавеющая сталь","Ø12","Ø min=16","Державка A12K SCLCR 06","Пластина CCMT 060204EN-M55 CTPM125",null,"Нержавеющая сталь","Ø12","Ø min=16","Державка A12K SDUCR 07","Пластина DCMT 070204EN-M25 CTPM125"]
["Нержавеющая сталь","Ø16","Ø min=20","Державка A16M SCLCR 09","Пластина CCMT 09T308EN-M55 CTPM125",null,"Нержавеющая сталь","Ø16","Ø min=20","Державка A16M SDUCR 07","Пластина DCMT 070204EN-M25 CTPM125"]
["Нержавеющая сталь","Ø20","Ø min=25","Державка A20Q SCLCR 09","Пластина CCMT 09T308EN-M55 CTPM125",null,"Нержавеющая сталь","Ø20","Ø min=25","Державка A20Q SDUCR 11","Пластина DCMT 11T304EN-M25 CTPM125"]
["Нержавеющая сталь","Ø25","Ø min=32","Державка A25R SCLCR 09","Пластина CCMT 09T308EN-M55 CTPM125",null,"Нержавеющая сталь","Ø25","Ø min=32","Державка A25R SDUCR 11","Пластина DCMT 11T304EN-M25 CTPM125"]
["Нержавеющая сталь","Ø40","Ø min=50","Державка A40T SCLCR 12","Пластина CCMT 120408EN-M55 CTPM125",null,"Нержавеющая сталь","Ø40","Ø min=50","Державка A40T SDUCR 11","Пластина DCMT 11T304EN-M25 CTPM125"]
["Цветные сплавы","Ø12","Ø min=16","Державка A12K SCLCR 06","Пластина CCGT 060204FN-25P H210T",null,"Цветные сплавы","Ø12","Ø min=16","Державка A12K SDUCR 07","Пластина DCGT 070204FN-25P H210T"]
["Цветные сплавы","Ø16","Ø min=20","Державка A16M SCLCR 09","Пластина CCGT 09T308FN-25P H210T",null,"Цветные сплавы","Ø16","Ø min=20","Державка A16M SDUCR 07","Пластина DCGT 070204FN-25P H210T"]
["Цветные сплавы","Ø20","Ø min=25","Державка A20Q SCLCR 09","Пластина CCGT 09T308FN-25P H210T",null,"Цветные сплавы","Ø20","Ø min=25","Державка A20Q SDUCR 11","Пластина DCGT 11T304FN-25P H210T"]
["Цветные сплавы","Ø25","Ø min=32","Державка A25R SCLCR 09","Пластина CCGT 09T308FN-25P H210T",null,"Цветные сплавы","Ø25","Ø min=32","Державка A25R SDUCR 11","Пластина DCGT 11T304FN-25P H210T"]
{"$rows_left_out":2}
{"sheet":"Лист4","index":3,"n_rows":13,"n_cols":14,"rows_kept":13,"cut":false,"hidden":true,"merged":[]}
["Материал","Сечение","T max","Державка","Пластина",null,"Материал","Сечение","T max","Державка","Пластина",null,"Сталь","S≤3,0 мм"]
["Сталь","16х16","Tmax=12","Державка E16R0012-1616K-GX16-1","Пластина GX16-1E2.00N0.20-M40 CTP1340",null,"Сталь","16х16","Tmax=12","Державка E16R0012-1616K-GX16-2","Пластина GX16-2E3.00N0.30-M40 CTP1340",null,"Нержавеющая сталь","S≥3,0 мм"]
["Сталь","20х20","Tmax=12","Державка E20R0012-2020K-GX16-1","Пластина GX16-1E2.00N0.20-M40 CTP1340",null,"Сталь","20х20","Tmax=12","Державка E20R0012-2020K-GX16-2","Пластина GX16-2E3.00N0.30-M40 CTP1340",null,"Цветные сплавы"]
["Сталь","25х25","Tmax=21","Державка E25R0021-2525M-GX24-2","Пластина GX24-2E3.00N0.30-M40 CTP1340",null,"Сталь","25х25","Tmax=21","Державка E25R0021-2525M-GX24-3","Пластина GX24-3E4.00N0.40-M40 CTP1340"]
["Сталь","32х25","Tmax=21","Державка E32R0021-3225P-GX24-2","Пластина GX24-2E3.00N0.30-M40 CTP1340",null,"Сталь","32х25","Tmax=21","Державка E32R0021-3225P-GX24-3","Пластина GX24-3E4.00N0.40-M40 CTP1340"]
["Нержавеющая сталь","16х16","Tmax=12","Державка E16R0012-1616K-GX16-1","Пластина GX16-1E2.00N0.20-M40 CTPP345","???","Нержавеющая сталь","16х16","Tmax=12","Державка E16R0012-1616K-GX16-2","Пластина GX16-2E3.00N0.30-M40 CTPP345","???"]
["Нержавеющая сталь","20х20","Tmax=12","Державка E20R0012-2020K-GX16-1","Пластина GX16-1E2.00N0.20-M40 CTPP345","???","Нержавеющая сталь","20х20","Tmax=12","Державка E20R0012-2020K-GX16-2","Пластина GX16-2E3.00N0.30-M40 CTPP345","???"]
["Нержавеющая сталь","25х25","Tmax=21","Державка E25R0021-2525M-GX24-2","Пластина GX24-2E3.00N0.30-M40 CTPP345","???","Нержавеющая сталь","25х25","Tmax=21","Державка E25R0021-2525M-GX24-3","Пластина GX24-3E4.00N0.40-M40 CTPP345","???"]
["Нержавеющая сталь","32х25","Tmax=21","Державка E32R0021-3225P-GX24-2","Пластина GX24-2E3.00N0.30-M40 CTPP345","???","Нержавеющая сталь","32х25","Tmax=21","Державка E32R0021-3225P-GX24-3","Пластина GX24-3E4.00N0.40-M40 CTPP345","???"]
["Цветные сплавы","16х16","Tmax=12","Державка E16R0012-1616K-GX16-1","Пластина GX16-1E2.00N0.20-27P H216T",null,"Цветные сплавы","16х16","Tmax=12","Державка E16R0012-1616K-GX16-2","Пластина GX16-2E3.00N0.30-27P H216T"]
["Цветные сплавы","20х20","Tmax=12","Державка E20R0012-2020K-GX16-1","Пластина GX16-1E2.00N0.20-27P H216T",null,"Цветные сплавы","20х20","Tmax=12","Державка E20R0012-2020K-GX16-2","Пластина GX16-2E3.00N0.30-27P H216T"]
["Цветные сплавы","25х25","Tmax=21","Державка E25R0021-2525M-GX24-2","Пластина GX24-2E3.00N0.30-27P H216T",null,"Цветные сплавы","25х25","Tmax=21","Державка E25R0021-2525M-GX24-3","Пластина GX24-3E4.00N0.40-27P H216T"]
["Цветные сплавы","32х25","Tmax=21","Державка E32R0021-3225P-GX24-2","Пластина GX24-2E3.00N0.30-27P H216T",null,"Цветные сплавы","32х25","Tmax=21","Державка E32R0021-3225P-GX24-3","Пластина GX24-3E4.00N0.40-27P H216T"]

{"sheet":"Лист5","index":4,"n_rows":13,"n_cols":14,"rows_kept":13,"cut":false,"hidden":true,"merged":[]}
["Материал","Сечение","Ø min/T max","Державка","Пластина",null,"Материал","Сечение","Ø min/T max","Державка","Пластина",null,"Сталь","S≤3,0 мм"]
["Сталь","Ø16","Ømin=20,5/Tmax=5,5","Державка I16R90-2.0D-GX16-1","Пластина GX16-1E2.00N0.20-M40 CTP1340",null,"Сталь","Ø16","Ømin=20,5/Tmax=5,5","Державка I16R90-2.0D-GX16-2","Пластина GX16-2E3.00N0.30-M40 CTP1340",null,"Нержавеющая сталь","S≥3,0 мм"]
["Сталь","Ø20","Ømin=25,0/Tmax=5,5","Державка I20R90-2.0D-GX16-2","Пластина GX16-2E3.00N0.30-M40 CTP1340",null,"Сталь","Ø20","Ømin=25,0/Tmax=5,5","Державка I20R90-2.0D-GX16-2","Пластина GX16-2E3.50N0.30 CTP1340",null,"Цветные сплавы"]
["Сталь","Ø25","Ømin=32,0/Tmax=8,0","Державка I25R90-2.0D-GX16-2","Пластина GX16-2E3.00N0.30-M40 CTP1340",null,"Сталь","Ø25","Ømin=32,0/Tmax=8,0","Державка I25R90-2.0D-GX16-3","Пластина GX16-3E4.00N0.40-M40 CTP1340"]
["Сталь","Ø32","Ømin=42,0/Tmax=11,0","Державка I32R90-2.0D-GX16-2","Пластина GX16-2E3.00N0.30-M40 CTP1340",null,"Сталь","Ø32","Ømin=42,0/Tmax=11,0","Державка I32R90-2.0D-GX16-3","Пластина GX16-3E4.00N0.40-M40 CTP1340"]
["Нержавеющая сталь","Ø16","Ømin=20,5/Tmax=5,5","Державка I16R90-2.0D-GX16-1","Пластина GX16-1E2.00N0.20-M40 CTPP345","???","Нержавеющая сталь","Ø16","Ømin=20,5/Tmax=5,5","Державка I16R90-2.0D-GX16-2","Пластина GX16-2E3.00N0.30-M40 CTPP345","???"]
["Нержавеющая сталь","Ø20","Ømin=25,0/Tmax=5,5","Державка I20R90-2.0D-GX16-2","Пластина GX16-2E3.00N0.30-M40 CTPP345","???","Нержавеющая сталь","Ø20","Ømin=25,0/Tmax=5,5","Державка I20R90-2.0D-GX16-2","Пластина GX16-2E3.00N0.30-M40 CTPP345","???"]
["Нержавеющая сталь","Ø25","Ømin=32,0/Tmax=8,0","Державка I25R90-2.0D-GX16-2","Пластина GX16-2E3.00N0.30-M40 CTPP345","???","Нержавеющая сталь","Ø25","Ømin=32,0/Tmax=8,0","Державка I25R90-2.0D-GX16-3","Пластина GX16-3E4.00N0.40-M40 CTPP345","???"]
["Нержавеющая сталь","Ø32","Ømin=42,0/Tmax=11,0","Державка I32R90-2.0D-GX16-2","Пластина GX16-2E3.00N0.30-M40 CTPP345","???","Нержавеющая сталь","Ø32","Ømin=42,0/Tmax=11,0","Державка I32R90-2.0D-GX16-3","Пластина GX16-3E4.00N0.40-M40 CTPP345","???"]
["Цветные сплавы","Ø16","Ømin=20,5/Tmax=5,5","Державка I16R90-2.0D-GX16-1","Пластина GX16-1E2.00N0.20-27P H216T",null,"Цветные сплавы","Ø16","Ømin=20,5/Tmax=5,5","Державка I16R90-2.0D-GX16-2","Пластина GX16-2E3.00N0.30-27P H216T"]
["Цветные сплавы","Ø20","Ømin=25,0/Tmax=5,5","Державка I20R90-2.0D-GX16-2","Пластина GX16-2E3.00N0.30-27P H216T",null,"Цветные сплавы","Ø20","Ømin=25,0/Tmax=5,5","Державка I20R90-2.0D-GX16-2","Пластина GX16-2E3.00N0.30-27P H216T"]
["Цветные сплавы","Ø25","Ømin=32,0/Tmax=8,0","Державка I25R90-2.0D-GX16-2","Пластина GX16-2E3.00N0.30-27P H216T",null,"Цветные сплавы","Ø25","Ømin=32,0/Tmax=8,0","Державка I25R90-2.0D-GX16-3","Пластина GX16-3E4.00N0.40-27P H216T"]
["Цветные сплавы","Ø32","Ømin=42,0/Tmax=11,0","Державка I32R90-2.0D-GX16-2","Пластина GX16-2E3.00N0.30-27P H216T",null,"Цветные сплавы","Ø32","Ømin=42,0/Tmax=11,0","Державка I32R90-2.0D-GX16-3","Пластина GX16-3E4.00N0.40-27P H216T"]

{"sheet":"Лист6","index":5,"n_rows":32,"n_cols":5,"rows_kept":32,"cut":false,"hidden":true,"merged":[]}
["Ø хвостовика","Ø сверла","Сверло",null,"Универсальное применение"]
["хвостовик Ø6,0",3,"Сверло 5511-3,0"]
["хвостовик Ø6,0",3.3,"Сверло 5511-3,3"]
["хвостовик Ø6,0",3.5,"Сверло 5511-3,5"]
["хвостовик Ø6,0",4,"Сверло 5511-4,0"]
["хвостовик Ø6,0",4.2,"Сверло 5511-4,2"]
["хвостовик Ø6,0",4.5,"Сверло 5511-4,5"]
["хвостовик Ø6,0",5,"Сверло 5511-5,0"]
["хвостовик Ø6,0",5.5,"Сверло 5511-5,5"]
["хвостовик Ø6,0",6,"Сверло 5511-6,0"]
["хвостовик Ø8,0",6.5,"Сверло 5511-6,5"]
["хвостовик Ø8,0",6.7,"Сверло 5511-6,7"]
["хвостовик Ø8,0",7,"Сверло 5511-7,0"]
["хвостовик Ø8,0",7.5,"Сверло 5511-7,5"]
["хвостовик Ø8,0",8,"Сверло 5511-8,0"]
{"$rows_left_out":18}
{"sheet":"Лист7","index":6,"n_rows":24,"n_cols":6,"rows_kept":24,"cut":false,"hidden":true,"merged":[]}
["Материал","Резьба, M"," хвостовик","Метчик",null,"Сталь"]
["Сталь",4,"хвостовик Ø4,5х□3,4","Метчик N360V-3 M4 101713",null,"Нержавеющая сталь"]
["Сталь",5,"хвостовик Ø6,0х□4,9","Метчик N360V-3 M5 101715",null,"Цветные сплавы"]
["Сталь",6,"хвостовик Ø6,0х□4,9","Метчик N360V-3 M6 101717"]
["Сталь",8,"хвостовик Ø8,0х□6,2","Метчик N360V-3 M8 101721"]
["Сталь",10,"хвостовик Ø10,0х□8,0","Метчик N360V-3 M10 101707"]
["Сталь",12,"хвостовик Ø9,0х□7,0","Метчик N460V-3 M12 102465"]
["Сталь",14,"хвостовик Ø11,0х□9,0","Метчик N460V-3 M14 102468"]
["Сталь",16,"хвостовик Ø12,0х□9,0","Метчик N460V-3 M16 102471"]
["Нержавеющая сталь",4,"хвостовик Ø4,5х□3,4","Метчик Z362V-3 M4 104689"]
["Нержавеющая сталь",5,"хвостовик Ø6,0х□4,9","Метчик Z362V-3 M5 104690"]
["Нержавеющая сталь",6,"хвостовик Ø6,0х□4,9","Метчик Z362V-3 M6 104691"]
["Нержавеющая сталь",8,"хвостовик Ø8,0х□6,2","Метчик Z362V-3 M8 104692"]
["Нержавеющая сталь",10,"хвостовик Ø10,0х□8,0","Метчик Z362V-3 M10 104683"]
["Нержавеющая сталь",12,"хвостовик Ø9,0х□7,0","Метчик Z462V-3 M12 104742"]
{"$rows_left_out":10}
{"sheet":"Лист8","index":7,"n_rows":61,"n_cols":7,"rows_kept":61,"cut":false,"hidden":true,"merged":[]}
["Сечение","Шаг резьбы, мм","Державка","Пластина",null,"16х16","Универсальное применение"]
["16х16",0.35,"Державка HER 1616H16","Пластина ISO 0.35 ER16 K420C",null,"20х20"]
["16х16",0.4,"Державка HER 1616H16","Пластина ISO 0.4 ER16 K420C",null,"25х25"]
["16х16",0.45,"Державка HER 1616H16","Пластина ISO 0.45 ER16 K420C",null,"32х32"]
["16х16",0.5,"Державка HER 1616H16","Пластина ISO 0.5 ER16 K420C"]
["16х16",0.6,"Державка HER 1616H16","Пластина ISO 0.6 ER16 K420C"]
["16х16",0.7,"Державка HER 1616H16","Пластина ISO 0.7 ER16 K420C"]
["16х16",0.75,"Державка HER 1616H16","Пластина ISO 0.75 ER16 K420C"]
["16х16",0.8,"Державка HER 1616H16","Пластина ISO 0.8 ER16 K420C"]
["16х16",1,"Державка HER 1616H16","Пластина ISO 1.0 ER16 K420C"]
["16х16",1.25,"Державка HER 1616H16","Пластина ISO 1.25 ER16 K420C"]
["16х16",1.5,"Державка HER 1616H16","Пластина ISO 1.5 ER16 K420C"]
["16х16",1.75,"Державка HER 1616H16","Пластина ISO 1.75 ER16 K420C"]
["16х16",2,"Державка HER 1616H16","Пластина ISO 2.0 ER16 K420C"]
["16х16",2.5,"Державка HER 1616H16","Пластина ISO 2.5 ER16 K420C"]
{"$rows_left_out":47}
{"sheet":"Лист9","index":8,"n_rows":50,"n_cols":7,"rows_kept":50,"cut":false,"hidden":true,"merged":[]}
["Сечение","Шаг резьбы, мм","Державка","Пластина",null,"Ø12","Универсальное применение"]
["Ø12",0.5,"Державка HIR0012H06","Пластина ISO 0.5 IR06 K420C",null,"Ø16"]
["Ø12",0.75,"Державка HIR0012H06","Пластина ISO 0.75 IR06 K420C",null,"Ø20"]
["Ø12",1,"Державка HIR0012H06","Пластина ISO 1.0 IR06 K420C",null,"Ø25"]
["Ø12",1.25,"Державка HIR0012H06","Пластина ISO 1.25 IR06 K420C"]
["Ø16",0.35,"Державка HIR0013M16","Пластина ISO 0.35 IR16 K420C"]
["Ø16",0.4,"Державка HIR0013M16","Пластина ISO 0.4 IR16 K420C"]
["Ø16",0.45,"Державка HIR0013M16","Пластина ISO 0.45 IR16 K420C"]
["Ø16",0.5,"Державка HIR0013M16","Пластина ISO 0.5 IR16 K420C"]
["Ø16",0.6,"Державка HIR0013M16","Пластина ISO 0.6 IR16 K420C"]
["Ø16",0.7,"Державка HIR0013M16","Пластина ISO 0.7 IR16 K420C"]
["Ø16",0.75,"Державка HIR0013M16","Пластина ISO 0.75 IR16 K420C"]
["Ø16",0.8,"Державка HIR0013M16","Пластина ISO 0.8 IR16 K420C"]
["Ø16",1,"Державка HIR0013M16","Пластина ISO 1.0 IR16 K420C"]
["Ø16",1.25,"Державка HIR0013M16","Пластина ISO 1.25 IR16 K420C"]
{"$rows_left_out":36}
{"sheet":"Лист10","index":9,"n_rows":16,"n_cols":6,"rows_kept":16,"cut":false,"hidden":true,"merged":[]}
["Материал","Сечение","Державка","Пластина",null,"Сталь"]
["Сталь","Ø12","Резец-сверло ECC 10R-2.25D 05","Пластина XCNT 050204EN CTCP425",null,"Нержавеющая сталь"]
["Сталь","Ø16","Резец-сверло ECC 12R-2.25D 06","Пластина XCNT 060204EN CTCP425",null,"Цветные сплавы"]
["Сталь","Ø20","Резец-сверло ECC 16R-2.25D 08","Пластина XCNT 080304EN CTCP425"]
["Сталь","Ø25","Резец-сверло ECC 18R-2.25D 09","Пластина XCNT 09T304EN CTCP425"]
["Сталь","Ø32","Резец-сверло ECC 25R-2.25D 13","Пластина XCNT 130408EN CTCP425"]
["Нержавеющая сталь","Ø12","Резец-сверло ECC 10R-2.25D 05","Пластина XCNT 050204EN CTPP430","???"]
["Нержавеющая сталь","Ø16","Резец-сверло ECC 12R-2.25D 06","Пластина XCNT 060204EN CTPP430","???"]
["Нержавеющая сталь","Ø20","Резец-сверло ECC 16R-2.25D 08","Пластина XCNT 080304EN CTPP430","???"]
["Нержавеющая сталь","Ø25","Резец-сверло ECC 18R-2.25D 09","Пластина XCNT 09T304EN CTPP430","???"]
["Нержавеющая сталь","Ø32","Резец-сверло ECC 25R-2.25D 13","Пластина XCNT 130408EN CTPP430","???"]
["Цветные сплавы","Ø12","Резец-сверло ECC 10R-2.25D 05","Пластина XCET 050204FN-27P H216T"]
["Цветные сплавы","Ø16","Резец-сверло ECC 12R-2.25D 06","Пластина XCET 060204FN-27P H216T"]
["Цветные сплавы","Ø20","Резец-сверло ECC 16R-2.25D 08","Пластина XCET 080304FN-27P H216T"]
["Цветные сплавы","Ø25","Резец-сверло ECC 18R-2.25D 09","Пластина XCET 09T304FN-27P H216T"]
{"$rows_left_out":2}
{"sheet":"Лист11","index":10,"n_rows":10,"n_cols":6,"rows_kept":10,"cut":false,"hidden":true,"merged":[]}
["Материал","Сечение","Державка","Пластина",null,"Сталь"]
["Сталь","16х16","Державка E16R0020-1616K-SX3","Пластина SX E3.00R6-M1 CTP1340",null,"Нержавеющая сталь"]
["Сталь","20х20","Державка E20R0025-2020K-SX4","Пластина SX E4.00R6-M1 CTP1340",null,"Цветные сплавы"]
["Сталь","25х25","Державка E25R0025-2525M-SX4","Пластина SX E4.00R6-M1 CTP1340"]
["Нержавеющая сталь","16х16","Державка E16R0020-1616K-SX3","Пластина SX E3.00R6-M1 CTP1340"]
["Нержавеющая сталь","20х20","Державка E20R0025-2020K-SX4","Пластина SX E4.00R6-M1 CTP1340"]
["Нержавеющая сталь","25х25","Державка E25R0025-2525M-SX4","Пластина SX E4.00R6-M1 CTP1340"]
["Цветные сплавы","16х16","Державка E16R0020-1616K-SX3","Пластина SX E3.00R6-M1 CTP1340"]
["Цветные сплавы","20х20","Державка E20R0025-2020K-SX4","Пластина SX E4.00R6-M1 CTP1340"]
["Цветные сплавы","25х25","Державка E25R0025-2525M-SX4","Пластина SX E4.00R6-M1 CTP1340"]

{"sheet":"Спецификация","index":11,"n_rows":1,"n_cols":4,"rows_kept":1,"cut":false,"hidden":false,"merged":[]}
["№","Наименование","Количество","Комментарии"]